BDBM50230132 CHEMBL324568::SKF-106760
SMILES [#6]-[#7]-1-[#6@@H](-[#6]-[#6]-[#6]\[#7]=[#6](/[#7])-[#7])-[#6](=O)-[#7]-[#6]-[#6](=O)-[#7]-[#6@@H](-[#6]-[#6](-[#8])=O)-[#6](=O)-[#7]-[#6@@H](-[#6]-[#16]-[#16]-[#6]-[#6@H](-[#7]-[#6](-[#6])=O)-[#6]-1=O)-[#6](-[#7])=O
InChI Key InChIKey=WZFJXIKSGKCGRW-XUXIUFHCSA-N
Data  1 KI  1 IC50
  Tab Delimited (TSV)   2D SDfile   Computed 3D by Vconf -m prep SDfile
Find this compound or compounds like it in BindingDB:
Activity Spreadsheet -- Enzyme Inhibition Constant Data from BindingDB
Found 2 hits for monomerid = 50230132
TargetIntegrin alpha-IIb/beta-3(Homo sapiens (Human))
Smithkline Beecham Pharmaceuticals
Curated by ChEMBL
LigandPNGBDBM50230132(CHEMBL324568 | SKF-106760)
Affinity DataKi:  175nM. Assay description: Inhibition of ADP-induced platelet aggregation in canine platelet-rich plasma
In DepthDetails ArticlePubMed
TargetIntegrin alpha-IIb/beta-3(Homo sapiens (Human))
Smithkline Beecham Pharmaceuticals
Curated by ChEMBL
LigandPNGBDBM50230132(CHEMBL324568 | SKF-106760)
Affinity DataIC50:  360nM. Assay description: Inhibition of ADP-induced platelet aggregation in canine platelet-rich plasma
In DepthDetails ArticlePubMed