BDBM50230236 CHEMBL2112000
SMILES Cc1[n+]([O-])ccc2[nH]c(=O)ccc12
InChI Key InChIKey=AHRSWVMNWQOYPY-UHFFFAOYSA-N
Data  1 IC50
  Tab Delimited (TSV)   2D SDfile   Computed 3D by Vconf -m prep SDfile
Find this compound or compounds like it in BindingDB:
Activity Spreadsheet -- Enzyme Inhibition Constant Data from BindingDB
Found 1 hit for monomerid = 50230236
TargetcGMP-inhibited 3',5'-cyclic phosphodiesterase 3A/3B(Homo sapiens (Human))
Sterling Winthrop Pharmaceuticals Research Division
Curated by ChEMBL
LigandPNGBDBM50230236(CHEMBL2112000)
Affinity DataIC50:  3.10E+3nM. Assay description: In vitro inhibitory activity against cAMP PDE III.
In DepthDetails ArticlePubMed