BDBM50230426 CHEMBL367565
SMILES CCCCc1nc(Cl)c2COc3cc(ccc3Cn12)-c1ccccc1C(O)=O
InChI Key InChIKey=SOSGRPPRPMLBMN-UHFFFAOYSA-N
Data  1 IC50
  Tab Delimited (TSV)   2D SDfile   Computed 3D by Vconf -m prep SDfile
Find this compound or compounds like it in BindingDB:
Activity Spreadsheet -- Enzyme Inhibition Constant Data from BindingDB
Found 1 hit for monomerid = 50230426
TargetType-1/Type-2 angiotensin II receptor(Homo sapiens (Human))
Ici Pharmaceuticals Group
Curated by ChEMBL
LigandPNGBDBM50230426(CHEMBL367565)
Affinity DataIC50:  8.50E+3nM. Assay description: Inhibition of [3-[125I]-iodotyrosyl]-angiotensin II binding to Angiotensin II receptors in the membrane preparations of guinea pig adrenal glands.
In DepthDetails ArticlePubMed