BDBM50230539 CHEMBL172334
SMILES CCCc1nc2ccccc2n1Cc1ccc(cc1)C(O)=O
InChI Key InChIKey=PBNUDKSNPPOLGF-UHFFFAOYSA-N
Data  1 IC50
  Tab Delimited (TSV)   2D SDfile   Computed 3D by Vconf -m prep SDfile
Find this compound or compounds like it in BindingDB:
Activity Spreadsheet -- Enzyme Inhibition Constant Data from BindingDB
Found 1 hit for monomerid = 50230539
TargetType-1/Type-2 angiotensin II receptor(Homo sapiens (Human))
Ici Pharmaceuticals Group
Curated by ChEMBL
LigandPNGBDBM50230539(CHEMBL172334)
Affinity DataIC50:  1.10E+4nM. Assay description: Inhibition of [3-[125I]-iodotyrosyl]-angiotensin II binding to Angiotensin II receptors in the membrane preparations of guinea pig adrenal glands.
In DepthDetails ArticlePubMed