BDBM50230622 CHEMBL274212
SMILES CCOc1cc2OCOc2cc1Cc1ccc(OC)cc1
InChI Key InChIKey=UJCODZLQXNZQPJ-UHFFFAOYSA-N
Data  1 IC50
  Tab Delimited (TSV)   2D SDfile   Computed 3D by Vconf -m prep SDfile
Find this compound or compounds like it in BindingDB:
Activity Spreadsheet -- Enzyme Inhibition Constant Data from BindingDB
Found 1 hit for monomerid = 50230622
TargetSimilar to alpha-tubulin isoform 1(Bos taurus)
National Cancer Institute-Bethesda
Curated by ChEMBL
LigandPNGBDBM50230622(CHEMBL274212)
Affinity DataIC50:  2.00E+3nM. Assay description: Inhibition of glutamate-dependent tubulin polymerization at 30 degrees C(0.25 mM MgCl2)
In DepthDetails ArticlePubMed