BDBM50230624 CHEMBL269215
SMILES COc1ccc(CCc2cc3OCOc3cc2OC)cc1
InChI Key InChIKey=OBMOWNJATBDROM-UHFFFAOYSA-N
Data  1 IC50
  Tab Delimited (TSV)   2D SDfile   Computed 3D by Vconf -m prep SDfile
Find this compound or compounds like it in BindingDB:
Activity Spreadsheet -- Enzyme Inhibition Constant Data from BindingDB
Found 1 hit for monomerid = 50230624
TargetSimilar to alpha-tubulin isoform 1(Bos taurus)
National Cancer Institute-Bethesda
Curated by ChEMBL
LigandPNGBDBM50230624(CHEMBL269215)
Affinity DataIC50:  8.80E+3nM. Assay description: Inhibition of glutamate-dependent tubulin polymerization at 30 degrees C(0.25 mM MgCl2)
In DepthDetails ArticlePubMed