BDBM50230632 CHEMBL10185
SMILES COc1ccc(CCCCc2cc3OCOc3cc2OC)cc1
InChI Key InChIKey=YYDCUQCZWDTIQP-UHFFFAOYSA-N
Data  1 IC50
  Tab Delimited (TSV)   2D SDfile   Computed 3D by Vconf -m prep SDfile
Find this compound or compounds like it in BindingDB:
Activity Spreadsheet -- Enzyme Inhibition Constant Data from BindingDB
Found 1 hit for monomerid = 50230632
TargetSimilar to alpha-tubulin isoform 1(Bos taurus)
National Cancer Institute-Bethesda
Curated by ChEMBL
LigandPNGBDBM50230632(CHEMBL10185)
Affinity DataIC50:  7.50E+3nM. Assay description: Inhibition of glutamate-dependent tubulin polymerization at 30 degrees C(0.25 mM MgCl2)
In DepthDetails ArticlePubMed