BDBM50230655 CHEMBL3349662
SMILES CC(C)[C@H](NC(=O)OCc1ccccc1)C(=O)N[C@@H](Cc1ccccc1)[C@H](O)C(=O)N1CCC[C@H]1C(=O)NC(C)(C)C
InChI Key InChIKey=VKJFDINBGLGOFB-FWEHEUNISA-N
Data  1 IC50
  Tab Delimited (TSV)   2D SDfile   Computed 3D by Vconf -m prep SDfile
Find this compound or compounds like it in BindingDB:
Activity Spreadsheet -- Enzyme Inhibition Constant Data from BindingDB
Found 1 hit for monomerid = 50230655
TargetGag-Pol polyprotein [489-587](Human immunodeficiency virus type 1)
Syntex Research
Curated by ChEMBL
LigandPNGBDBM50230655(CHEMBL3349662)
Affinity DataIC50:  4.30nM. Assay description: Inhibitory activity of the Compound was tested against HIV protease enzyme.(value reported by Rich etal)
In DepthDetails ArticlePubMed