BDBM50230742 CHEMBL1202600
SMILES Cl.Cl.[H][C@@]12C(COC1=O)[C@H](CCN(C)Cc1ccccn1)c1cc3OCOc3cc1[C@H]2c1cc(OC)c(O)c(OC)c1
InChI Key InChIKey=JJZNUEXOFZDWGY-TXIPJBKQSA-N
Data  1 IC50
  Tab Delimited (TSV)   2D SDfile   Computed 3D by Vconf -m prep SDfile
Find this compound or compounds like it in BindingDB:
Activity Spreadsheet -- Enzyme Inhibition Constant Data from BindingDB
Found 1 hit for monomerid = 50230742
TargetSimilar to alpha-tubulin isoform 1(Bos taurus)
Taiho Pharmaceutical
Curated by ChEMBL
LigandPNGBDBM50230742(CHEMBL1202600)
Affinity DataIC50: >1.00E+5nM. Assay description: Drug concentration needed to produce a 50% reduction of bovine brain tubulin polymerization relative to the control
In DepthDetails ArticlePubMed