BDBM50230844 CHEMBL71470
SMILES COc1ccccc1N1CCN(CC2CN3C(=N2)c2ccccc2N=C3SC)CC1
InChI Key InChIKey=PPXOXVLQYQNCLT-UHFFFAOYSA-N
Data  2 KI
  Tab Delimited (TSV)   2D SDfile   Computed 3D by Vconf -m prep SDfile
Find this compound or compounds like it in BindingDB:
Activity Spreadsheet -- Enzyme Inhibition Constant Data from BindingDB
Found 2 hits for monomerid = 50230844
TargetAlpha-1A/Alpha-1B/Alpha-1D adrenergic receptor(Rattus norvegicus (rat))
National Defense Medical Center
Curated by ChEMBL
LigandPNGBDBM50230844(CHEMBL71470)
Affinity DataKi:  0.340nM. Assay description: Binding affinity against alpha-1 adrenergic receptor by measuring displacement of [3H]prazosin from rat brain cortex membranes (in vitro).
In DepthDetails ArticlePubMed
LigandPNGBDBM50230844(CHEMBL71470)
Affinity DataKi:  1.78E+3nM. Assay description: Binding affinity against alpha-2 adrenergic receptor by measuring displacement of [3H]clonidine from rat brain cortex membranes (in vitro).
In DepthDetails ArticlePubMed