BDBM50230845 CHEMBL2114073
SMILES CN1C(=O)N2C(CN3CCN(CC3)c3ccccc3)CN=C2c2ccccc12
InChI Key InChIKey=DDBDQJLGWORGPW-UHFFFAOYSA-N
Data  1 KI
  Tab Delimited (TSV)   2D SDfile   Computed 3D by Vconf -m prep SDfile
Find this compound or compounds like it in BindingDB:
Activity Spreadsheet -- Enzyme Inhibition Constant Data from BindingDB
Found 1 hit for monomerid = 50230845
TargetAlpha-1A/Alpha-1B/Alpha-1D adrenergic receptor(Rattus norvegicus (rat))
National Defense Medical Center
Curated by ChEMBL
LigandPNGBDBM50230845(CHEMBL2114073)
Affinity DataKi:  15nM. Assay description: Binding affinity against alpha-1 adrenergic receptor by measuring displacement of [3H]prazosin from rat brain cortex membranes (in vitro).
In DepthDetails ArticlePubMed