BDBM50230849 CHEMBL71207
SMILES CN1C(=O)N2CC(CN3CCN(CC3)c3ccccc3)N=C2c2ccccc12
InChI Key InChIKey=DTQSNPZHCWXURD-UHFFFAOYSA-N
Data  2 KI
  Tab Delimited (TSV)   2D SDfile   Computed 3D by Vconf -m prep SDfile
Find this compound or compounds like it in BindingDB:
Activity Spreadsheet -- Enzyme Inhibition Constant Data from BindingDB
Found 2 hits for monomerid = 50230849
TargetAlpha-1A/Alpha-1B/Alpha-1D adrenergic receptor(Rattus norvegicus (rat))
National Defense Medical Center
Curated by ChEMBL
LigandPNGBDBM50230849(CHEMBL71207)
Affinity DataKi:  11nM. Assay description: Binding affinity against alpha-1 adrenergic receptor by measuring displacement of [3H]prazosin from rat brain cortex membranes (in vitro).
In DepthDetails ArticlePubMed
LigandPNGBDBM50230849(CHEMBL71207)
Affinity DataKi:  3.33E+3nM. Assay description: Binding affinity against alpha-2 adrenergic receptor by measuring displacement of [3H]clonidine from rat brain cortex membranes (in vitro).
In DepthDetails ArticlePubMed