BDBM50230850 CHEMBL309149
SMILES Clc1ccccc1N1CCN(CC2CN3C(=N2)c2ccccc2NC3=O)CC1
InChI Key InChIKey=WQVURQCXIRJDTR-UHFFFAOYSA-N
Data  2 KI
  Tab Delimited (TSV)   2D SDfile   Computed 3D by Vconf -m prep SDfile
Find this compound or compounds like it in BindingDB:
Activity Spreadsheet -- Enzyme Inhibition Constant Data from BindingDB
Found 2 hits for monomerid = 50230850
TargetAlpha-1A/Alpha-1B/Alpha-1D adrenergic receptor(Rattus norvegicus (rat))
National Defense Medical Center
Curated by ChEMBL
LigandPNGBDBM50230850(CHEMBL309149)
Affinity DataKi:  1.10nM. Assay description: Binding affinity against alpha-1 adrenergic receptor by measuring displacement of [3H]prazosin from rat brain cortex membranes (in vitro).
In DepthDetails ArticlePubMed
LigandPNGBDBM50230850(CHEMBL309149)
Affinity DataKi:  3.17E+3nM. Assay description: Binding affinity against alpha-2 adrenergic receptor by measuring displacement of [3H]clonidine from rat brain cortex membranes (in vitro).
In DepthDetails ArticlePubMed