BDBM50230869 CHEMBL68213
SMILES COc1ccc(cc1)N1CCN(CC2CN3C(=N2)c2ccccc2NC3=O)CC1
InChI Key InChIKey=YFEZJKYEWSFHFG-UHFFFAOYSA-N
Data  1 KI
  Tab Delimited (TSV)   2D SDfile   Computed 3D by Vconf -m prep SDfile
Find this compound or compounds like it in BindingDB:
Activity Spreadsheet -- Enzyme Inhibition Constant Data from BindingDB
Found 1 hit for monomerid = 50230869
TargetAlpha-1A/Alpha-1B/Alpha-1D adrenergic receptor(Rattus norvegicus (rat))
National Defense Medical Center
Curated by ChEMBL
LigandPNGBDBM50230869(CHEMBL68213)
Affinity DataKi: >100nM. Assay description: Binding affinity against alpha-1 adrenergic receptor by measuring displacement of [3H]prazosin from rat brain cortex membranes (in vitro).
In DepthDetails ArticlePubMed