BDBM50230872 CHEMBL71492
SMILES O=C1Nc2ccccc2C2=NC(CN3CCN(CC3)c3ccccc3)CN12
InChI Key InChIKey=ONSOQRPYFKDOEB-UHFFFAOYSA-N
Data  2 KI
  Tab Delimited (TSV)   2D SDfile   Computed 3D by Vconf -m prep SDfile
Find this compound or compounds like it in BindingDB:
Activity Spreadsheet -- Enzyme Inhibition Constant Data from BindingDB
Found 2 hits for monomerid = 50230872
TargetAlpha-1A/Alpha-1B/Alpha-1D adrenergic receptor(Rattus norvegicus (rat))
National Defense Medical Center
Curated by ChEMBL
LigandPNGBDBM50230872(CHEMBL71492)
Affinity DataKi:  2nM. Assay description: Binding affinity against alpha-1 adrenergic receptor by measuring displacement of [3H]prazosin from rat brain cortex membranes (in vitro).
In DepthDetails ArticlePubMed
LigandPNGBDBM50230872(CHEMBL71492)
Affinity DataKi:  3.86E+3nM. Assay description: Binding affinity against alpha-2 adrenergic receptor by measuring displacement of [3H]clonidine from rat brain cortex membranes (in vitro).
In DepthDetails ArticlePubMed