BDBM50230877 CHEMBL70371
SMILES CCCCc1nc(c(C(O)=O)n1Cc1ccc(cc1)-c1ccccc1-c1nn[nH]n1)-n1cccc1C(=O)C(F)(F)F
InChI Key InChIKey=WZWUTWJBFAVKER-UHFFFAOYSA-N
Data  2 IC50
  Tab Delimited (TSV)   2D SDfile   Computed 3D by Vconf -m prep SDfile
Find this compound or compounds like it in BindingDB:
Activity Spreadsheet -- Enzyme Inhibition Constant Data from BindingDB
Found 2 hits for monomerid = 50230877
TargetType-1/Type-2 angiotensin II receptor(Homo sapiens (Human))
Warner-Lambert
Curated by ChEMBL
LigandPNGBDBM50230877(CHEMBL70371)
Affinity DataIC50:  4nM. Assay description: Inhibitory concentration against [125I]angiotensin II(AII) induced contraction in rabbit aorta by 50%
In DepthDetails ArticlePubMed
TargetType-1 angiotensin II receptor A/B(RAT)
Warner-Lambert
Curated by ChEMBL
LigandPNGBDBM50230877(CHEMBL70371)
Affinity DataIC50:  2.40nM. Assay description: Inhibitory concentration against binding of [125I]angiotensin II to rat liver expressing Angiotensin II receptor
In DepthDetails ArticlePubMed