BDBM50230879 CHEMBL309094
SMILES CCCc1ccc(C)n1-c1nc(CCC)n(Cc2ccc(cc2)-c2ccccc2-c2nn[nH]n2)c1C(=O)OC
InChI Key InChIKey=KPAWCUOJJMOTDD-UHFFFAOYSA-N
Data  2 IC50
  Tab Delimited (TSV)   2D SDfile   Computed 3D by Vconf -m prep SDfile
Find this compound or compounds like it in BindingDB:
Activity Spreadsheet -- Enzyme Inhibition Constant Data from BindingDB
Found 2 hits for monomerid = 50230879
TargetType-1 angiotensin II receptor A/B(RAT)
Warner-Lambert
Curated by ChEMBL
LigandPNGBDBM50230879(CHEMBL309094)
Affinity DataIC50:  15nM. Assay description: Inhibitory concentration against binding of [125I]angiotensin II to rat liver expressing Angiotensin II receptor
In DepthDetails ArticlePubMed
TargetType-1/Type-2 angiotensin II receptor(Homo sapiens (Human))
Warner-Lambert
Curated by ChEMBL
LigandPNGBDBM50230879(CHEMBL309094)
Affinity DataIC50: >100nM. Assay description: Inhibitory concentration against [125I]angiotensin II(AII) induced contraction in rabbit aorta by 50%
In DepthDetails ArticlePubMed