BDBM50231019 CHEMBL402622::sodium (3R,5R)-7-(2-(4-fluorophenyl)-5-isopropyl-4-(4-methylpiperazin-1-ylsulfonyl)-3-phenyl-1H-pyrrol-1-yl)-3,5-dihydroxyheptanoate
SMILES CC(C)c1c(c(c(-c2ccc(F)cc2)n1CC[C@@H](O)C[C@@H](O)CC([O-])=O)-c1ccccc1)S(=O)(=O)N1CCN(C)CC1
InChI Key InChIKey=NQPKWFHCRRXCBX-CLJLJLNGSA-M
Data  1 IC50
  Tab Delimited (TSV)   2D SDfile   Computed 3D by Vconf -m prep SDfile
Find this compound or compounds like it in BindingDB:
Activity Spreadsheet -- Enzyme Inhibition Constant Data from BindingDB
Found 1 hit for monomerid = 50231019
Target3-hydroxy-3-methylglutaryl-coenzyme A reductase(Rattus norvegicus (rat))
Pfizer
Curated by ChEMBL
LigandPNGBDBM50231019(CHEMBL402622 | sodium (3R,5R)-7-(2-(4-fluorophenyl...)
Affinity DataIC50:  2.70nM. Assay description: Inhibition of rat microsomal HMGCoA reductase
In DepthDetails ArticlePubMed