BDBM50231029 CHEMBL404671::sodium; (3R,5R)-7-[3-(4-carbamoyl-phenylsulfamoyl)-4,5-bis-(4-fluoro-phenyl)-2-isopropyl-pyrrol-1-yl]-3,5-dihydroxy-heptanoate
SMILES CC(C)c1c(c(c(-c2ccc(F)cc2)n1CC[C@@H](O)C[C@@H](O)CC([O-])=O)-c1ccc(F)cc1)S(=O)(=O)Nc1ccc(cc1)C(N)=O
InChI Key InChIKey=IYYNBGFAAGBIAX-KAYWLYCHSA-M
Data  1 IC50
  Tab Delimited (TSV)   2D SDfile   Computed 3D by Vconf -m prep SDfile
Find this compound or compounds like it in BindingDB:
Activity Spreadsheet -- Enzyme Inhibition Constant Data from BindingDB
Found 1 hit for monomerid = 50231029
Target3-hydroxy-3-methylglutaryl-coenzyme A reductase(Rattus norvegicus (rat))
Pfizer
Curated by ChEMBL
LigandPNGBDBM50231029(CHEMBL404671 | sodium; (3R,5R)-7-[3-(4-carbamoyl-p...)
Affinity DataIC50:  5.80nM. Assay description: Inhibition of rat microsomal HMGCoA reductase
In DepthDetails ArticlePubMed