BDBM50231279 1-(3-aminobenzo[d]isoxazol-5-yl)-6-{4-[(3-dimethylaminopropyl)pyridin-4-ylamino]-2-fluorophenyl}-7-fluoro-1H-indazole-3-carboxamide::CHEMBL223042
SMILES CN(C)CCCN(c1ccncc1)c1ccc(c(F)c1)-c1ccc2c(nn(-c3ccc4onc(N)c4c3)c2c1F)C(N)=O
InChI Key InChIKey=BSOGETFZKSQMJK-UHFFFAOYSA-N
Data  1 KI
  Tab Delimited (TSV)   2D SDfile   Computed 3D by Vconf -m prep SDfile
Find this compound or compounds like it in BindingDB:
Activity Spreadsheet -- Enzyme Inhibition Constant Data from BindingDB
Found 1 hit for monomerid = 50231279
TargetCoagulation factor X(Homo sapiens (Human))
Johnson & Johnson Pharmaceutical Research And Development
Curated by ChEMBL
LigandPNGBDBM50231279(1-(3-aminobenzo[d]isoxazol-5-yl)-6-{4-[(3-dimethyl...)
Affinity DataKi:  5.20nM. Assay description: Inhibition of human factor 10a
In DepthDetails ArticlePubMed