BDBM50231446 CHEMBL252430::N-(5-(2-(4-(benzo[d]isothiazol-3-yl)piperazin-1-yl)ethyl)-2,3-dihydro-1H-inden-1-yl)nicotinamide
SMILES O=C(NC1CCc2cc(CCN3CCN(CC3)c3nsc4ccccc34)ccc12)c1cccnc1
InChI Key InChIKey=GFQPGTMHAHWZHS-UHFFFAOYSA-N
Data  5 KI
  Tab Delimited (TSV)   2D SDfile   Computed 3D by Vconf -m prep SDfile
Find this compound or compounds like it in BindingDB:
Activity Spreadsheet -- Enzyme Inhibition Constant Data from BindingDB
Found 5 hits for monomerid = 50231446
Target5-hydroxytryptamine receptor 2A(Homo sapiens (Human))
Pfizer
Curated by ChEMBL
LigandPNGBDBM50231446(CHEMBL252430 | N-(5-(2-(4-(benzo[d]isothiazol-3-yl...)
Affinity DataKi:  0.680nM. Assay description: Displacement of [3H]ketanserin from human 5HT2A receptor expressed in Swiss 3T3 cells
In DepthDetails ArticlePubMed
TargetD(2) dopamine receptor(Homo sapiens (Human))
Pfizer
Curated by ChEMBL
LigandPNGBDBM50231446(CHEMBL252430 | N-(5-(2-(4-(benzo[d]isothiazol-3-yl...)
Affinity DataKi:  5nM. Assay description: Displacement of [3H]spiperone from human D2L receptor expressed in CHO cells
In DepthDetails ArticlePubMed
Target5-hydroxytryptamine receptor 1A(Homo sapiens (Human))
Pfizer
Curated by ChEMBL
LigandPNGBDBM50231446(CHEMBL252430 | N-(5-(2-(4-(benzo[d]isothiazol-3-yl...)
Affinity DataKi:  7.70nM. Assay description: Displacement of [3H]8OHDPAT from human 5HT1A receptor
In DepthDetails ArticlePubMed
TargetAlpha-1A adrenergic receptor(Rattus norvegicus (Rat))
Pfizer
Curated by ChEMBL
LigandPNGBDBM50231446(CHEMBL252430 | N-(5-(2-(4-(benzo[d]isothiazol-3-yl...)
Affinity DataKi:  17.4nM. Assay description: Displacement of [3H]prazosin from rat adrenergic alpha1A receptor expressed in fibroblast cells
In DepthDetails ArticlePubMed
TargetPotassium voltage-gated channel subfamily H member 2(Homo sapiens (Human))
Pfizer
Curated by ChEMBL
LigandPNGBDBM50231446(CHEMBL252430 | N-(5-(2-(4-(benzo[d]isothiazol-3-yl...)
Affinity DataKi:  202nM. Assay description: Displacement of [3H]dofetilide from human ERG channel expressed in HEK293 cells
In DepthDetails ArticlePubMed