BDBM50231572 CHEMBL3350844
SMILES CCCCCCCCCCCCOC(=O)C1=C(C)NC(C)=C(C1c1ccccc1C(F)(F)F)C(=O)OC
InChI Key InChIKey=PRWXRQIEOLXETF-UHFFFAOYSA-N
Data  1 KI
  Tab Delimited (TSV)   2D SDfile   Computed 3D by Vconf -m prep SDfile
Find this compound or compounds like it in BindingDB:
Activity Spreadsheet -- Enzyme Inhibition Constant Data from BindingDB
Found 1 hit for monomerid = 50231572
TargetVoltage-dependent L-type calcium channel subunit alpha-1C(RAT)
State University Of New York
Curated by ChEMBL
LigandPNGBDBM50231572(CHEMBL3350844)
Affinity DataKi:  17nM. Assay description: Inhibition of [3H](+)-PN200-110 binding to L-type calcium channel 1,4-DHP binding site of rat ventricular myocytes
In DepthDetails ArticlePubMed