BDBM50232739 CHEMBL4085658::US11046670, Compound 20
SMILES [H][C@]12C[C@@]([H])(N(Cc3ccccc3)CC1)c1cc(ccc21)N1CCOCC1
InChI Key InChIKey=PEVJAEWZDBAABH-XMSQKQJNSA-N
Data  4 KI
  Tab Delimited (TSV)   2D SDfile   Computed 3D by Vconf -m prep SDfile
Find this compound or compounds like it in BindingDB:
Activity Spreadsheet -- Enzyme Inhibition Constant Data from BindingDB
Found 4 hits for monomerid = 50232739
TargetSigma intracellular receptor 2(Homo sapiens (Human))
Board Of Regents, The University Of Texas System
US Patent
LigandPNGBDBM50232739(CHEMBL4085658 | US11046670, Compound 20)
Affinity DataKi:  1.03E+3nM
In DepthDetails US Patent
TargetSigma intracellular receptor 2(Rattus norvegicus (Rat))
The University Of Texas At Austin
Curated by ChEMBL
LigandPNGBDBM50232739(CHEMBL4085658 | US11046670, Compound 20)
Affinity DataKi:  1.18E+3nM. Assay description: Displacement of [3H]-ditolylguanidine from sigma2 receptor in rat PC12 cells in presence of (+)-pentazocine by PDSP assay
In DepthDetails ArticlePubMed
TargetSigma non-opioid intracellular receptor 1(Cavia porcellus (Guinea pig))
The University Of Texas At Austin
Curated by ChEMBL
LigandPNGBDBM50232739(CHEMBL4085658 | US11046670, Compound 20)
Affinity DataKi:  2.84E+3nM. Assay description: Displacement of [3H]-(+)-pentazocine from guinea pig brain sigma1 receptor by PDSP assay
In DepthDetails ArticlePubMed
TargetSigma non-opioid intracellular receptor 1(Homo sapiens (Human))
Board Of Regents, The University Of Texas System
US Patent
LigandPNGBDBM50232739(CHEMBL4085658 | US11046670, Compound 20)
Affinity DataKi:  3.78E+3nM. Assay description: Receptor binding assays were performed by the Psychoactive Drug Screening Program (PDSP) at Chapel Hill, N.C. The assay protocol book can be accessed...
In DepthDetails US Patent