BDBM502336 US11028090, Example 229::{4-[1-methyl- 7-(1-methyl- 1H-benzo- imidazole-2- yl)-[1,2,4]tri- azolo[4,3- a]quinoxaline- 4-ylamino]- butyl}- carbamic acid cyclopent- ylester
SMILES Cc1nnc2c(NCCCCNC(=O)OC3CCCC3)nc3cc(ccc3n12)-c1nc2ccccc2n1C
InChI Key InChIKey=ZPYRHRWBXNOVGL-UHFFFAOYSA-N
Data  1 IC50
  Tab Delimited (TSV)   2D SDfile   Computed 3D by Vconf -m prep SDfile
Find this compound or compounds like it in BindingDB:
Activity Spreadsheet -- Enzyme Inhibition Constant Data from BindingDB
Found 1 hit for monomerid = 502336
TargetBromodomain-containing protein 4(Homo sapiens (Human))
Dong Wha Pharm.
US Patent
LigandPNGBDBM502336(US11028090, Example 229 | {4-[1-methyl- 7-(1-methy...)
Affinity DataIC50:  3nM. Assay description: The following experiment was performed to evaluate the ability of [1,2,4]triazolo[4,3-a]quinoxaline derivative of the present invention to inhibit th...
Ligand InfoPC cidPC sid
In DepthDetails US Patent