BDBM50233702 5-cyano-N-(4-(3-(ethyl(methyl)amino)propyl)-2-(piperidin-1-yl)phenyl)furan-2-carboxamide::CHEMBL398508
SMILES CCN(C)CCCc1ccc(NC(=O)c2ccc(o2)C#N)c(c1)N1CCCCC1
InChI Key InChIKey=LPDNURVKUXADQK-UHFFFAOYSA-N
Data  1 IC50
  Tab Delimited (TSV)   2D SDfile   Computed 3D by Vconf -m prep SDfile
Find this compound or compounds like it in BindingDB:
Activity Spreadsheet -- Enzyme Inhibition Constant Data from BindingDB
Found 1 hit for monomerid = 50233702
TargetMacrophage colony-stimulating factor 1 receptor(Homo sapiens (Human))
Johnson & Johnson Pharmaceutical Research & Development
Curated by ChEMBL
LigandPNGBDBM50233702(5-cyano-N-(4-(3-(ethyl(methyl)amino)propyl)-2-(pip...)
Affinity DataIC50:  52nM. Assay description: Inhibition of human cytoplasmic FMS expressed in Sf9-baculovirus system after 80 mins by fluorescence polarization
In DepthDetails ArticlePubMed