BDBM50233717 5-cyano-N-(4-ethoxy-2-(piperidin-1-yl)phenyl)furan-2-carboxamide::CHEMBL253884
SMILES CCOc1ccc(NC(=O)c2ccc(o2)C#N)c(c1)N1CCCCC1
InChI Key InChIKey=WQHQQCDDYREMET-UHFFFAOYSA-N
Data  1 IC50
  Tab Delimited (TSV)   2D SDfile   Computed 3D by Vconf -m prep SDfile
Find this compound or compounds like it in BindingDB:
Activity Spreadsheet -- Enzyme Inhibition Constant Data from BindingDB
Found 1 hit for monomerid = 50233717
TargetMacrophage colony-stimulating factor 1 receptor(Homo sapiens (Human))
Johnson & Johnson Pharmaceutical Research & Development
Curated by ChEMBL
LigandPNGBDBM50233717(5-cyano-N-(4-ethoxy-2-(piperidin-1-yl)phenyl)furan...)
Affinity DataIC50:  21nM. Assay description: Inhibition of human cytoplasmic FMS expressed in Sf9-baculovirus system after 80 mins by fluorescence polarization
In DepthDetails ArticlePubMed