BDBM50233722 (2R,4S,5R)-5-((R)-acetamido((R)-3,6-dihydro-2H-pyran-2-yl)methyl)-4-(prop-1-enyl)pyrrolidine-2-carboxylic acid::CHEMBL254885
SMILES C\C=C/[C@@H]1C[C@@H](N[C@H]1[C@@H](NC(C)=O)[C@H]1CC=CCO1)C(O)=O
InChI Key InChIKey=CEFQDCLGNHXSIJ-DCJTVAHFSA-N
Data  1 KI
  Tab Delimited (TSV)   2D SDfile   Computed 3D by Vconf -m prep SDfile
Find this compound or compounds like it in BindingDB:
Activity Spreadsheet -- Enzyme Inhibition Constant Data from BindingDB
Found 1 hit for monomerid = 50233722
TargetNeuraminidase(Influenza B virus (B/Lee/40))
Abbott Laboratories
Curated by ChEMBL
LigandPNGBDBM50233722((2R,4S,5R)-5-((R)-acetamido((R)-3,6-dihydro-2H-pyr...)
Affinity DataKi:  10.3nM. Assay description: Inhibition of influenza B/Memphis/3/89 neuraminidase
In DepthDetails ArticlePubMed