BDBM50234565 CHEMBL4093453
SMILES COc1cccc(CCC(=O)NC[C@H]2N[C@H](CO)[C@H](O)[C@@H]2O)c1
InChI Key InChIKey=LSOLKJRKNUDSGQ-XOUADPBQSA-N
Data  2 IC50
  Tab Delimited (TSV)   2D SDfile   Computed 3D by Vconf -m prep SDfile
Find this compound or compounds like it in BindingDB:
Activity Spreadsheet -- Enzyme Inhibition Constant Data from BindingDB
Found 2 hits for monomerid = 50234565
TargetAlpha-galactosidase A(Homo sapiens (Human))
National Cheng Kung University
Curated by ChEMBL
LigandPNGBDBM50234565(CHEMBL4093453)
Affinity DataIC50:  1.30E+4nM. Assay description: Inhibition of recombinant human alpha GAL-A using 4-methylumbelliferyl alpha-D-galactopyranoside as substrate at pH 7 after 15 mins by fluorescence a...
In DepthDetails ArticlePubMed
TargetAlpha-galactosidase A(Homo sapiens (Human))
National Cheng Kung University
Curated by ChEMBL
LigandPNGBDBM50234565(CHEMBL4093453)
Affinity DataIC50:  1.91E+4nM. Assay description: Inhibition of recombinant human alpha GAL-A using 4-methylumbelliferyl alpha-D-galactopyranoside as substrate at pH 4.6 after 15 mins by fluorescence...
In DepthDetails ArticlePubMed