BDBM502348 3-methyl-N- {4-[1-methyl- 7-(1-propyl- 1H- benzoimid- azole-2-yl)- [1,2,4]tri- azolo[4,3- a]quinoxaline- 4-ylamino]- butyl}- butyramide::US11028090, Example 240
SMILES CCCn1c(nc2ccccc12)-c1ccc2c(c1)nc(NCCCCNC(=O)CC(C)C)c1nnc(C)n21
InChI Key InChIKey=PVUPWHUZNLNSLB-UHFFFAOYSA-N
Data  1 IC50
  Tab Delimited (TSV)   2D SDfile   Computed 3D by Vconf -m prep SDfile
Find this compound or compounds like it in BindingDB:
Activity Spreadsheet -- Enzyme Inhibition Constant Data from BindingDB
Found 1 hit for monomerid = 502348
TargetBromodomain-containing protein 4(Homo sapiens (Human))
Dong Wha Pharm.
US Patent
LigandPNGBDBM502348(3-methyl-N- {4-[1-methyl- 7-(1-propyl- 1H- benzoim...)
Affinity DataIC50:  0.900nM. Assay description: The following experiment was performed to evaluate the ability of [1,2,4]triazolo[4,3-a]quinoxaline derivative of the present invention to inhibit th...
Ligand InfoPC cidPC sid
In DepthDetails US Patent