BDBM50235148 CHEMBL4062123
SMILES [H][C@@]12CC(C)(C)CC[C@@]1([C@H](O)C[C@]1(C)C2=CC[C@]2([H])[C@@]3(C)CC[C@H](O)[C@](C)(CO)[C@]3([H])CC[C@@]12C)C(=O)O[C@@H]1O[C@H](CO)[C@@H](O)[C@H](O)[C@H]1O
InChI Key InChIKey=YRYDGRXPKGZLPI-JKIRXONSSA-N
Data  1 IC50
  Tab Delimited (TSV)   2D SDfile   Computed 3D by Vconf -m prep SDfile
Find this compound or compounds like it in BindingDB:
Activity Spreadsheet -- Enzyme Inhibition Constant Data from BindingDB
Found 1 hit for monomerid = 50235148
TargetTissue factor(Homo sapiens (Human))
China Pharmaceutical University
Curated by ChEMBL
LigandPNGBDBM50235148(CHEMBL4062123)
Affinity DataIC50:  0.801nM. Assay description: Inhibition of LPS-induced tissue factor procoagulant activity in human THP1 cells preincubated for 1 hr followed by LPS addition measured after 5 hrs...
In DepthDetails ArticlePubMed