BDBM50235259 CHEMBL4105245
SMILES Clc1ccccc1-c1ncccc1CC(c1cccnc1)c1cccnc1Cl
InChI Key InChIKey=XYAPGPIGTTXTDZ-UHFFFAOYSA-N
Data  2 IC50
  Tab Delimited (TSV)   2D SDfile   Computed 3D by Vconf -m prep SDfile
Find this compound or compounds like it in BindingDB:
Activity Spreadsheet -- Enzyme Inhibition Constant Data from BindingDB
Found 2 hits for monomerid = 50235259
TargetPotassium voltage-gated channel subfamily A member 5(Homo sapiens (Human))
Merck Research Laboratories
Curated by ChEMBL
LigandPNGBDBM50235259(CHEMBL4105245)
Affinity DataIC50:  26nM. Assay description: Inhibition of Kv1.5 (unknown origin)
In DepthDetails ArticlePubMed
TargetPotassium voltage-gated channel subfamily H member 2(Homo sapiens (Human))
Merck Research Laboratories
Curated by ChEMBL
LigandPNGBDBM50235259(CHEMBL4105245)
Affinity DataIC50: >3.00E+4nM. Assay description: Displacement of [3H]-MK499 from human ERG IKr channel expressed in HEK293 cell membranes
In DepthDetails ArticlePubMed