BDBM50235269 CHEMBL4072707
SMILES Cc1cc(F)ccc1-c1ccccc1C(C#N)C(c1cccnc1)c1cccnc1
InChI Key InChIKey=VWXGLTZGEZWEIV-UHFFFAOYSA-N
Data  2 IC50
  Tab Delimited (TSV)   2D SDfile   Computed 3D by Vconf -m prep SDfile
Find this compound or compounds like it in BindingDB:
Activity Spreadsheet -- Enzyme Inhibition Constant Data from BindingDB
Found 2 hits for monomerid = 50235269
TargetPotassium voltage-gated channel subfamily H member 2(Homo sapiens (Human))
Merck Research Laboratories
Curated by ChEMBL
LigandPNGBDBM50235269(CHEMBL4072707)
Affinity DataIC50: >3.00E+4nM. Assay description: Displacement of [3H]-MK499 from human ERG IKr channel expressed in HEK293 cell membranes
In DepthDetails ArticlePubMed
TargetPotassium voltage-gated channel subfamily A member 5(Homo sapiens (Human))
Merck Research Laboratories
Curated by ChEMBL
LigandPNGBDBM50235269(CHEMBL4072707)
Affinity DataIC50:  137nM. Assay description: Inhibition of Kv1.5 (unknown origin)
In DepthDetails ArticlePubMed