BDBM50235383 ACT-293987::NS-304::Selexipag::Uptravi
SMILES CC(C)N(CCCCOCC(=O)NS(C)(=O)=O)c1cnc(-c2ccccc2)c(n1)-c1ccccc1
InChI Key InChIKey=QXWZQTURMXZVHJ-UHFFFAOYSA-N
Data  1 IC50  3 EC50
  Tab Delimited (TSV)   2D SDfile   Computed 3D by Vconf -m prep SDfile
Find this compound or compounds like it in BindingDB:
Activity Spreadsheet -- Enzyme Inhibition Constant Data from BindingDB
Found 4 hits for monomerid = 50235383
TargetProstacyclin receptor(RAT)
Arena Pharmaceuticals
Curated by ChEMBL
LigandPNGBDBM50235383(ACT-293987 | NS-304 | Selexipag | Uptravi)
Affinity DataEC50:  200nM. Assay description: Agonist activity at recombinant rat IP receptor expressed in CHO-K1 cells assessed as increase in intracellular cAMP level after 1 hr incubation by H...
In DepthDetails ArticlePubMed
TargetProstaglandin D2 receptor(Homo sapiens (Human))
Arena Pharmaceuticals
Curated by ChEMBL
LigandPNGBDBM50235383(ACT-293987 | NS-304 | Selexipag | Uptravi)
Affinity DataEC50:  100nM. Assay description: Agonist activity at recombinant human DP1 receptor expressed in CHO-K1 cells assessed as increase in intracellular cAMP level after 1 hr incubation b...
In DepthDetails ArticlePubMed
TargetProstacyclin receptor(Homo sapiens (Human))
Arena Pharmaceuticals
Curated by ChEMBL
LigandPNGBDBM50235383(ACT-293987 | NS-304 | Selexipag | Uptravi)
Affinity DataIC50:  62nM. Assay description: Agonist activity at IP receptor in human primary platelets assessed as inhibition of ADP-induced platelet aggregation
In DepthDetails ArticlePubMed
TargetProstacyclin receptor(Homo sapiens (Human))
Arena Pharmaceuticals
Curated by ChEMBL
LigandPNGBDBM50235383(ACT-293987 | NS-304 | Selexipag | Uptravi)
Affinity DataEC50:  6nM. Assay description: Agonist activity at recombinant human IP receptor expressed in CHO-K1 cells assessed as increase in intracellular cAMP level after 1 hr incubation by...
In DepthDetails ArticlePubMed