BDBM50236384 (R)-2-(4-(1-(3-fluorobenzyl)-1H-indazol-5-ylamino)quinazolin-5-yloxy)-N-methylpropanamide::CHEMBL256994
SMILES CNC(=O)[C@@H](C)Oc1cccc2ncnc(Nc3ccc4n(Cc5cccc(F)c5)ncc4c3)c12
InChI Key InChIKey=WXVGRYVQNLPYBE-MRXNPFEDSA-N
Data  1 IC50
  Tab Delimited (TSV)   2D SDfile   Computed 3D by Vconf -m prep SDfile
Find this compound or compounds like it in BindingDB:
Activity Spreadsheet -- Enzyme Inhibition Constant Data from BindingDB
Found 1 hit for monomerid = 50236384
TargetReceptor tyrosine-protein kinase erbB-2(Homo sapiens (Human))
Astrazeneca
Curated by ChEMBL
LigandPNGBDBM50236384((R)-2-(4-(1-(3-fluorobenzyl)-1H-indazol-5-ylamino)...)
Affinity DataIC50:  57nM. Assay description: Inhibition of human erbB2 autophosphorylation in MCF7 cells
In DepthDetails ArticlePubMed