BDBM50236797 CHEMBL4074234
SMILES CN1CCN(Cc2cn(c3ccccc23)S(=O)(=O)c2ccc(Cl)cc2Cl)CC1
InChI Key InChIKey=JGHUQTWJRCHSKF-UHFFFAOYSA-N
Data  1 KI
  Tab Delimited (TSV)   2D SDfile   Computed 3D by Vconf -m prep SDfile
Find this compound or compounds like it in BindingDB:
Activity Spreadsheet -- Enzyme Inhibition Constant Data from BindingDB
Found 1 hit for monomerid = 50236797
Target5-hydroxytryptamine receptor 6(Homo sapiens (Human))
Suven Life Sciences
Curated by ChEMBL
LigandPNGBDBM50236797(CHEMBL4074234)
Affinity DataKi:  28nM. Assay description: Displacement of [3H]-LSD from recombinant human 5-HT6 receptor expressed in HEK293 cells after 60 mins
In DepthDetails ArticlePubMed