BDBM50237782 CHEMBL4059977
SMILES CNC(=O)[C@H]1[Se][C@H]([C@H](O)[C@@H]1O)n1cnc2c(NC)ncnc12
InChI Key InChIKey=RUMBHKCWEQQZLM-FLNNQWSLSA-N
Data  2 KI
  Tab Delimited (TSV)   2D SDfile   Computed 3D by Vconf -m prep SDfile
Find this compound or compounds like it in BindingDB:
Activity Spreadsheet -- Enzyme Inhibition Constant Data from BindingDB
Found 2 hits for monomerid = 50237782
TargetAdenosine receptor A3(Homo sapiens (Human))
Seoul National University
Curated by ChEMBL
LigandPNGBDBM50237782(CHEMBL4059977)
Affinity DataKi:  1.5nM. Assay description: Displacement of [125I]I-AB-MECA from human adenosine A3 receptor expressed in CHO cells after 60 mins by gamma counting analysis
In DepthDetails ArticlePubMed
TargetAdenosine receptor A1(Homo sapiens (Human))
Seoul National University
Curated by ChEMBL
LigandPNGBDBM50237782(CHEMBL4059977)
Affinity DataKi:  2.06E+3nM. Assay description: Displacement of [3H]R-PLA from human adenosine A1 receptor expressed in CHO cells after 60 mins by liquid scintillation analyzer
In DepthDetails ArticlePubMed