BDBM50238135 CHEMBL4074125
SMILES Cc1noc(C)c1-c1ccc2n(CCN3CCOCC3)c(CCc3ccc(N)cc3)nc2c1
InChI Key InChIKey=DWCHPIPMUGWMGT-UHFFFAOYSA-N
Data  2 IC50
  Tab Delimited (TSV)   2D SDfile   Computed 3D by Vconf -m prep SDfile
Find this compound or compounds like it in BindingDB:
Activity Spreadsheet -- Enzyme Inhibition Constant Data from BindingDB
Found 2 hits for monomerid = 50238135
TargetCREB-binding protein(Homo sapiens (Human))
Pfizer
Curated by ChEMBL
LigandPNGBDBM50238135(CHEMBL4074125)
Affinity DataIC50:  90nM. Assay description: Inhibition of CREBBP (unknown origin) by FRET assay
In DepthDetails ArticlePubMed
TargetBromodomain-containing protein 4(Homo sapiens (Human))
Pfizer
Curated by ChEMBL
LigandPNGBDBM50238135(CHEMBL4074125)
Affinity DataIC50:  3.40E+3nM. Assay description: Inhibition of BRD4 (unknown origin) by fluorescence polarization assay
In DepthDetails ArticlePubMed