BDBM50238142 CHEMBL4078019
SMILES CCc1noc(C)c1-c1ccc2n(CCN3CCOCC3)c(CCc3ccccc3)nc2c1
InChI Key InChIKey=OYWLGYKGTRBDIU-UHFFFAOYSA-N
Data  2 IC50
  Tab Delimited (TSV)   2D SDfile   Computed 3D by Vconf -m prep SDfile
Find this compound or compounds like it in BindingDB:
Activity Spreadsheet -- Enzyme Inhibition Constant Data from BindingDB
Found 2 hits for monomerid = 50238142
TargetCREB-binding protein(Homo sapiens (Human))
Pfizer
Curated by ChEMBL
LigandPNGBDBM50238142(CHEMBL4078019)
Affinity DataIC50:  310nM. Assay description: Inhibition of CREBBP (unknown origin) by FRET assay
In DepthDetails ArticlePubMed
TargetBromodomain-containing protein 4(Homo sapiens (Human))
Pfizer
Curated by ChEMBL
LigandPNGBDBM50238142(CHEMBL4078019)
Affinity DataIC50:  6.00E+3nM. Assay description: Inhibition of BRD4 (unknown origin) by fluorescence polarization assay
In DepthDetails ArticlePubMed