BDBM50238260 CHEMBL4094643
SMILES CN(C)c1ccc(CCc2nc3cc(ccc3n2CCN2CCOCC2)-c2c(C)noc2C)cc1
InChI Key InChIKey=HWSVSBNPYWADIN-UHFFFAOYSA-N
Data  2 IC50
  Tab Delimited (TSV)   2D SDfile   Computed 3D by Vconf -m prep SDfile
Find this compound or compounds like it in BindingDB:
Activity Spreadsheet -- Enzyme Inhibition Constant Data from BindingDB
Found 2 hits for monomerid = 50238260
TargetCREB-binding protein(Homo sapiens (Human))
Pfizer
Curated by ChEMBL
LigandPNGBDBM50238260(CHEMBL4094643)
Affinity DataIC50:  210nM. Assay description: Inhibition of CREBBP (unknown origin) by FRET assay
In DepthDetails ArticlePubMed
TargetBromodomain-containing protein 4(Homo sapiens (Human))
Pfizer
Curated by ChEMBL
LigandPNGBDBM50238260(CHEMBL4094643)
Affinity DataIC50:  4.30E+3nM. Assay description: Inhibition of BRD4 (unknown origin) by fluorescence polarization assay
In DepthDetails ArticlePubMed