BDBM50238665 PROTOKYLOL HYDROCHLORIDE::Protokylol HCl::Ventaire
SMILES Cl.CC(Cc1ccc2OCOc2c1)NCC(O)c1ccc(O)c(O)c1
InChI Key InChIKey=LOVXREQUMZKFCM-UHFFFAOYSA-N
Data  1 IC50
  Tab Delimited (TSV)   2D SDfile   Computed 3D by Vconf -m prep SDfile
Find this compound or compounds like it in BindingDB:
Activity Spreadsheet -- Enzyme Inhibition Constant Data from BindingDB
Found 1 hit for monomerid = 50238665
TargetBile salt export pump(Homo sapiens (Human))
Astrazeneca
Curated by ChEMBL
LigandPNGBDBM50238665(PROTOKYLOL HYDROCHLORIDE | Protokylol HCl | Ventai...)
Affinity DataIC50: >9.82E+5nM. Assay description: Inhibition of human BSEP expressed in baculovirus transfected fall armyworm Sf21 cell membranes vesicles assessed as reduction in ATP-dependent [3H]-...
In DepthDetails ArticlePubMed