BDBM50238726 CHEMBL4083780
SMILES NCCCCNC(=O)\C=C\c1ccc(cc1)C(=C1C2CC3CC(C2)CC1C3)c1ccc(O)cc1
InChI Key InChIKey=DHHNQRAKUUHCQW-CKKFNOSNSA-N
Data  1 KI
  Tab Delimited (TSV)   2D SDfile   Computed 3D by Vconf -m prep SDfile
Find this compound or compounds like it in BindingDB:
Activity Spreadsheet -- Enzyme Inhibition Constant Data from BindingDB
Found 1 hit for monomerid = 50238726
TargetEstrogen receptor(Homo sapiens (Human))
The Scripps Research Institute
Curated by ChEMBL
LigandPNGBDBM50238726(CHEMBL4083780)
Affinity DataKi:  0.320nM. Assay description: Displacement of [3H]estradiol from full-length human ERalpha receptor by scintillation counting
In DepthDetails ArticlePubMed