BDBM50238839 CHEMBL256982::N-(2-chloro-5-(1H-imidazol-2-yl)-5,6,7,8-tetrahydronaphthalen-1-yl)methanesulfonamide::N-[2-Chloro-5-(1H-imidazol-2-yl)-5,6,7,8-tetrahydro-naphthalen-1-yl]-methanesulfonamide
SMILES CS(=O)(=O)Nc1c(Cl)ccc2C(CCCc12)c1ncc[nH]1
InChI Key InChIKey=IWGVFEQPKZLBMA-UHFFFAOYSA-N
Data  6 EC50
  Tab Delimited (TSV)   2D SDfile   Computed 3D by Vconf -m prep SDfile
Find this compound or compounds like it in BindingDB:
Activity Spreadsheet -- Enzyme Inhibition Constant Data from BindingDB
Found 6 hits for monomerid = 50238839
TargetAlpha-1A adrenergic receptor(Homo sapiens (Human))
Pfizer
Curated by ChEMBL
LigandPNGBDBM50238839(CHEMBL256982 | N-(2-chloro-5-(1H-imidazol-2-yl)-5,...)
Affinity DataEC50:  43nM. Assay description: Agonist activity at human cloned adrenergic alpha1A receptor expressed in CHO cells by calcium mobilization-based fluorescence assay
In DepthDetails ArticlePubMed
TargetAlpha-1A adrenergic receptor(Homo sapiens (Human))
Pfizer
Curated by ChEMBL
LigandPNGBDBM50238839(CHEMBL256982 | N-(2-chloro-5-(1H-imidazol-2-yl)-5,...)
Affinity DataEC50:  43nM. Assay description: Agonist activity at human cloned adrenergic alpha1A receptor expressed in CHO cells assessed as calcium mobilization by FLIPR
In DepthDetails ArticlePubMed
TargetAlpha-1D adrenergic receptor(Homo sapiens (Human))
Pfizer
Curated by ChEMBL
LigandPNGBDBM50238839(CHEMBL256982 | N-(2-chloro-5-(1H-imidazol-2-yl)-5,...)
Affinity DataEC50: >1.00E+4nM. Assay description: Agonist activity at human cloned adrenergic Alpha-1D receptor expressed in CHO cells assessed as calcium mobilization by FLIPR
In DepthDetails ArticlePubMed
TargetAlpha-1A adrenergic receptor(Homo sapiens (Human))
Pfizer
Curated by ChEMBL
LigandPNGBDBM50238839(CHEMBL256982 | N-(2-chloro-5-(1H-imidazol-2-yl)-5,...)
Affinity DataEC50:  43nM. Assay description: Agonist activity at human cloned adrenergic alpha-1A receptor expressed in CHO cells assessed as calcium mobilization by FLIPR
In DepthDetails ArticlePubMed
TargetAlpha-1B adrenergic receptor(Homo sapiens (Human))
Pfizer
Curated by ChEMBL
LigandPNGBDBM50238839(CHEMBL256982 | N-(2-chloro-5-(1H-imidazol-2-yl)-5,...)
Affinity DataEC50: >1.00E+4nM. Assay description: Agonist activity at human cloned adrenergic alpha-1B receptor expressed in CHO cells assessed as calcium mobilization by FLIPR
In DepthDetails ArticlePubMed
TargetAlpha-2A adrenergic receptor(Homo sapiens (Human))
Pfizer
Curated by ChEMBL
LigandPNGBDBM50238839(CHEMBL256982 | N-(2-chloro-5-(1H-imidazol-2-yl)-5,...)
Affinity DataEC50: >1.00E+4nM. Assay description: Agonist activity at human cloned adrenergic alpha-2A receptor expressed in CHOK1 cells by beta-lactamase reporter gene assay
In DepthDetails ArticlePubMed