BDBM50239383 CHEMBL4096773
SMILES [H][C@]12C[C@@H](CO)N(C1)c1cc(Nc3cc4CCC(=O)N(CC5CC(F)(F)C5)c4c(OC\C=C\CO2)c3)n2ncc(Cl)c2n1
InChI Key InChIKey=FCTYRSMTSONLAX-AJLPNKGSSA-N
Data  3 IC50
  Tab Delimited (TSV)   2D SDfile   Computed 3D by Vconf -m prep SDfile
Find this compound or compounds like it in BindingDB:
Activity Spreadsheet -- Enzyme Inhibition Constant Data from BindingDB
Found 3 hits for monomerid = 50239383
TargetZinc finger and BTB domain-containing protein 16(Homo sapiens)
Astrazeneca
Curated by ChEMBL
LigandPNGBDBM50239383(CHEMBL4096773)
Affinity DataIC50: >3.00E+4nM. Assay description: Inhibition of GAL4 DNA binding domain fused PLZF BTB domain (unknown origin) expressed in HEK 293T/17 cells after 24 hrs by Bright-Glo luciferase cel...
In DepthDetails ArticlePubMed
TargetB-cell lymphoma 6 protein(Homo sapiens)
Astrazeneca
Curated by ChEMBL
LigandPNGBDBM50239383(CHEMBL4096773)
Affinity DataIC50:  501nM. Assay description: Inhibition of GAL4 DNA binding domain fused BCL6 BTB domain (unknown origin) expressed in HEK 293T/17 cells after 24 hrs by Bright-Glo luciferase cel...
In DepthDetails ArticlePubMed
TargetB-cell lymphoma 6 protein(Homo sapiens)
Astrazeneca
Curated by ChEMBL
LigandPNGBDBM50239383(CHEMBL4096773)
Affinity DataIC50:  480nM. Assay description: Inhibition of GAL4 DNA binding domain fused BCL6 BTB domain (unknown origin) expressed in HEK 293T/17 cells after 24 hrs by Bright-Glo luciferase cel...
In DepthDetails ArticlePubMed