BDBM50239385 CHEMBL4092565
SMILES [H][C@]12C[C@@H](CO)N(C1)c1cc(Nc3cc4CCC(=O)N(Cc5cccc(OC)c5)c4c(OC\C=C\CO2)c3)n2ncc(Cl)c2n1
InChI Key InChIKey=QUTCDOJKEIYLAL-ZPRFHTKYSA-N
Data  2 IC50
  Tab Delimited (TSV)   2D SDfile   Computed 3D by Vconf -m prep SDfile
Find this compound or compounds like it in BindingDB:
Activity Spreadsheet -- Enzyme Inhibition Constant Data from BindingDB
Found 2 hits for monomerid = 50239385
TargetZinc finger and BTB domain-containing protein 16(Homo sapiens)
Astrazeneca
Curated by ChEMBL
LigandPNGBDBM50239385(CHEMBL4092565)
Affinity DataIC50: >3.00E+4nM. Assay description: Inhibition of GAL4 DNA binding domain fused PLZF BTB domain (unknown origin) expressed in HEK 293T/17 cells after 24 hrs by Bright-Glo luciferase cel...
In DepthDetails ArticlePubMed
TargetB-cell lymphoma 6 protein(Homo sapiens)
Astrazeneca
Curated by ChEMBL
LigandPNGBDBM50239385(CHEMBL4092565)
Affinity DataIC50:  100nM. Assay description: Binding affinity against alpha-1 adrenergic receptor in guinea pig cerebral cortical membranes by displacement of [3H]- WB-4101
In DepthDetails ArticlePubMed