BDBM50240847 2,5-Bis-[1-phenyl-meth-(E)-ylidene]-cyclopentanone::2,5-dibenzylidenecyclopentanone::CHEMBL151734
SMILES O=C1\C(CC\C1=C/c1ccccc1)=C\c1ccccc1
InChI Key InChIKey=CVTOCKKPVXJIJK-HBKJEHTGSA-N
Data  4 IC50
  Tab Delimited (TSV)   2D SDfile   Computed 3D by Vconf -m prep SDfile
Find this compound or compounds like it in BindingDB:
Activity Spreadsheet -- Enzyme Inhibition Constant Data from BindingDB
Found 4 hits for monomerid = 50240847
TargetCytochrome P450 1A2(Homo sapiens (Human))
Vrije Universiteit
Curated by ChEMBL
LigandPNGBDBM50240847(2,5-Bis-[1-phenyl-meth-(E)-ylidene]-cyclopentanone...)
Affinity DataIC50:  3.66E+4nM. Assay description: Inhibition of human recombinant CYP1A2
In DepthDetails ArticlePubMed
TargetTrypanothione reductase(Trypanosoma cruzi)
Universidade Federal De Minas Gerais
Curated by ChEMBL
LigandPNGBDBM50240847(2,5-Bis-[1-phenyl-meth-(E)-ylidene]-cyclopentanone...)
Affinity DataIC50: >1.00E+5nM. Assay description: Inhibition of Trypanosoma cruzi trypanothione reductase expressed in Escherichia coli BL21(DE3) assessed as reduction of oxidized trypanothione prein...
In DepthDetails ArticlePubMed
TargetGlutathione reductase, mitochondrial(Homo sapiens (Human))
Universidade Federal De Minas Gerais
Curated by ChEMBL
LigandPNGBDBM50240847(2,5-Bis-[1-phenyl-meth-(E)-ylidene]-cyclopentanone...)
Affinity DataIC50: >1.00E+5nM. Assay description: Inhibition of human recombinant glutathione reductase using glutathione as substrate preincubated for 30 mins by colorimetric assay
In DepthDetails ArticlePubMed
TargetCytochrome P450 1A2(Homo sapiens (Human))
Vrije Universiteit
Curated by ChEMBL
LigandPNGBDBM50240847(2,5-Bis-[1-phenyl-meth-(E)-ylidene]-cyclopentanone...)
Affinity DataIC50:  3.66E+4nM. Assay description: Inhibition of human recombinant CYP1A2
In DepthDetails ArticlePubMed