BDBM50241189 2-(3-Acetylamino-phenyl)-2-oxoethyl Ethyl Trithiocarbonate::CHEMBL242473::trithiocarbonic acid 2-(3-acetylamino-phenyl)-2-oxo-ethyl ester ethyl ester
SMILES CCSC(=S)SCC(=O)c1cccc(NC(C)=O)c1
InChI Key InChIKey=CYMKTWZJWFXBKS-UHFFFAOYSA-N
Data  2 IC50
  Tab Delimited (TSV)   2D SDfile   Computed 3D by Vconf -m prep SDfile
Find this compound or compounds like it in BindingDB:
Activity Spreadsheet -- Enzyme Inhibition Constant Data from BindingDB
Found 2 hits for monomerid = 50241189
TargetHistone deacetylase 1(Homo sapiens (Human))
Nycomed
Curated by ChEMBL
LigandPNGBDBM50241189(2-(3-Acetylamino-phenyl)-2-oxoethyl Ethyl Trithioc...)
Affinity DataIC50:  2.93E+3nM. Assay description: Inhibition of recombinant HDAC1 (unknown origin) expressed in HEK293 cells
In DepthDetails ArticlePubMed
TargetHistone deacetylase 6(Homo sapiens (Human))
Nycomed
Curated by ChEMBL
LigandPNGBDBM50241189(2-(3-Acetylamino-phenyl)-2-oxoethyl Ethyl Trithioc...)
Affinity DataIC50:  329nM. Assay description: Inhibition of recombinant HDAC6 (unknown origin) expressed in HEK293 cells
In DepthDetails ArticlePubMed