BDBM50241959 CHEMBL4097097
SMILES FC(F)(F)c1cc(N\N=C(/C#N)C(=O)c2noc3ccccc23)cc(c1)C(F)(F)F
InChI Key InChIKey=RIWCFEQJXMUIRQ-UVHMKAGCSA-N
Data  1 IC50
  Tab Delimited (TSV)   2D SDfile   Computed 3D by Vconf -m prep SDfile
Find this compound or compounds like it in BindingDB:
Activity Spreadsheet -- Enzyme Inhibition Constant Data from BindingDB
Found 1 hit for monomerid = 50241959
TargetRap guanine nucleotide exchange factor 3(Homo sapiens (Human))
University Of Texas Medical Branch
Curated by ChEMBL
LigandPNGBDBM50241959(CHEMBL4097097)
Affinity DataIC50:  6.70E+3nM. Assay description: Antagonist activity at recombinant human full length EPAC1 assessed as inhibition of EPAC1-mediated Rap1B (1 to 167 residues)-BODIPY GDP nucleotide e...
In DepthDetails ArticlePubMed