BDBM50242279 6,7,8,11,12,13,22,23-octahydroxy-3,16-dioxo-21-(3,4,5-trihydroxyphenylcarbonyloxy)-2,17,20-trioxatetracyclo[17.3.1.04,9.010,15]tricosa-4(9),5,7,10(15),11,13-hexaene::6,7,8,11,12,13,22,23-octahydroxy-3,16-dioxo-21-(3,4,5-trihydroxyphenylcarbonyloxy)-2,17,20-trioxatetracyclo[17.3.1.04,9.010,15]tricosa-4,6,8,10,12,14-hexaene::CHEMBL449392::Tannin analogue::corilagin
SMILES O[C@@H]1[C@H]2COC(=O)c3cc(O)c(O)c(O)c3-c3c(O)c(O)c(O)cc3C(=O)O[C@@H]1[C@@H](O)[C@H](OC(=O)c1cc(O)c(O)c(O)c1)O2
InChI Key InChIKey=TUSDEZXZIZRFGC-XIGLUPEJSA-N
Data  4 IC50  2 EC50
  Tab Delimited (TSV)   2D SDfile   Computed 3D by Vconf -m prep SDfile
Find this compound or compounds like it in BindingDB:
Activity Spreadsheet -- Enzyme Inhibition Constant Data from BindingDB
Found 6 hits for monomerid = 50242279
TargetSqualene monooxygenase(Rattus norvegicus)
University Of Shizuoka
Curated by ChEMBL
LigandPNGBDBM50242279(6,7,8,11,12,13,22,23-octahydroxy-3,16-dioxo-21-(3,...)
Affinity DataIC50:  4.00E+3nM. Assay description: Inhibition of C-terminal hexahistidine-tagged rat recombinant squalene epoxidase without N-terminal putative membrane domain expressed in Escherichia...
In DepthDetails ArticlePubMed
TargetAngiotensin-converting enzyme(Homo sapiens (Human))
TBA
Curated by ChEMBL
LigandPNGBDBM50242279(6,7,8,11,12,13,22,23-octahydroxy-3,16-dioxo-21-(3,...)
Affinity DataIC50:  3.70E+6nM. Assay description: Inhibition of ACE by fluorometric assay
In DepthDetails ArticlePubMed
TargetAmyloid-beta precursor protein(Homo sapiens (Human))
Muroran Institute Of Technology
Curated by ChEMBL
LigandPNGBDBM50242279(6,7,8,11,12,13,22,23-octahydroxy-3,16-dioxo-21-(3,...)
Affinity DataEC50:  8.90nM. Assay description: Inhibition of amyloid beta 1 to 42 aggregation (unknown origin) incubated for 24 hrs by ThT fluorescence assay
In DepthDetails PubMed
TargetAmyloid-beta precursor protein(Homo sapiens (Human))
Muroran Institute Of Technology
Curated by ChEMBL
LigandPNGBDBM50242279(6,7,8,11,12,13,22,23-octahydroxy-3,16-dioxo-21-(3,...)
Affinity DataEC50:  3.20nM. Assay description: Inhibition of amyloid beta 1 to 42 aggregation (unknown origin) incubated for 24 hrs by inverted fluorescence microscopic analysis
In DepthDetails PubMed
TargetDNA topoisomerase 1(Homo sapiens (Human))
TBA
Curated by ChEMBL
LigandPNGBDBM50242279(6,7,8,11,12,13,22,23-octahydroxy-3,16-dioxo-21-(3,...)
Affinity DataIC50:  4.00E+4nM. Assay description: Inhibition of human COLO201 cellular topoisomerase-1 mediated plasmid DNA cleavage by electrophoresis in presence of 70 units of enzyme
In DepthDetails ArticlePubMed