BDBM50242800 2-((3,5-bis(trifluoromethyl)benzyl)(4-(N-methyl-4-(trifluoromethoxy)phenylsulfonamido)phenyl)amino)-2-oxoacetic acid::CHEMBL444564
SMILES CN(c1ccc(cc1)N(Cc1cc(cc(c1)C(F)(F)F)C(F)(F)F)C(=O)C(O)=O)S(=O)(=O)c1ccc(OC(F)(F)F)cc1
InChI Key InChIKey=JETANXIEFSEORA-UHFFFAOYSA-N
Data  1 IC50
  Tab Delimited (TSV)   2D SDfile   Computed 3D by Vconf -m prep SDfile
Find this compound or compounds like it in BindingDB:
Activity Spreadsheet -- Enzyme Inhibition Constant Data from BindingDB
Found 1 hit for monomerid = 50242800
TargetPlasminogen activator inhibitor 1(Homo sapiens (Human))
Zydus Research Centre
Curated by ChEMBL
LigandPNGBDBM50242800(2-((3,5-bis(trifluoromethyl)benzyl)(4-(N-methyl-4-...)
Affinity DataIC50:  2.50E+4nM. Assay description: Inhibition of human PAI1 by chromogenic assay
In DepthDetails ArticlePubMed