BDBM50242836 4-(2-{[(2R)-2-Hydroxy-2-(3-hydroxyphenyl)ethyl]amino}ethyl)-3-isopropoxy-4-biphenylcarboxylic acid::CHEMBL518168
SMILES CC(C)Oc1cc(ccc1C(O)=O)-c1ccc(CCNC[C@H](O)c2cccc(O)c2)cc1
InChI Key InChIKey=ZZHQCHNBDNTJMG-DEOSSOPVSA-N
Data  2 EC50
  Tab Delimited (TSV)   2D SDfile   Computed 3D by Vconf -m prep SDfile
Find this compound or compounds like it in BindingDB:
Activity Spreadsheet -- Enzyme Inhibition Constant Data from BindingDB
Found 2 hits for monomerid = 50242836
TargetBeta-1 adrenergic receptor(Homo sapiens (Human))
Astellas Pharma
Curated by ChEMBL
LigandPNGBDBM50242836(4-(2-{[(2R)-2-Hydroxy-2-(3-hydroxyphenyl)ethyl]ami...)
Affinity DataEC50:  440nM. Assay description: Agonist activity at human recombinant beta-1 adrenergic receptor expressed in CHO cells assessed as cAMP accumulation by enzyme immuno assay
In DepthDetails ArticlePubMed
TargetBeta-3 adrenergic receptor(Homo sapiens (Human))
Astellas Pharma
Curated by ChEMBL
LigandPNGBDBM50242836(4-(2-{[(2R)-2-Hydroxy-2-(3-hydroxyphenyl)ethyl]ami...)
Affinity DataEC50:  0.0620nM. Assay description: Agonist activity at human recombinant beta3 adrenergic receptor expressed in CHO cells assessed as cAMP accumulation by enzyme immuno assay
In DepthDetails ArticlePubMed